Reaction Details
TargetC-X-C chemokine receptor type 2
LigandBDBM50177602
Substrate/Competitorn/a
Meas. Tech.ChEMBL_334048 (CHEMBL862382)
IC50 50±n/a nM
Citation Baxter, ACooper, AKinchin, EMoakes, KUnitt, JWallace, A Hit-to-Lead studies: the discovery of potent, orally bioavailable thiazolopyrimidine CXCR2 receptor antagonists. Bioorg Med Chem Lett16:960-3 (2006) 
 
C-X-C chemokine receptor type 2
Name:C-X-C chemokine receptor type 2
Type:Protein
Mol. Mass.:40767.88
Organism:Homo sapiens (Human)
Description:P25025
Residue:360
BDBM50177602
NameBDBM50177602
Synonyms:2-(5-(3-phenoxybenzylthio)-2-aminothiazolo[4,5-d]pyrimidin-7-ylamino)-2-methylpropan-1-ol | CHEMBL204552
TypeSmall organic molecule
Emp. Form.C22H23N5O2S2
Mol. Mass.453.58
SMILESCC(C)(CO)Nc1nc(SCc2cccc(Oc3ccccc3)c2)nc2nc(N)sc12