Reaction Details
TargetC-X-C chemokine receptor type 2
LigandBDBM50177603
Substrate/Competitorn/a
Meas. Tech.ChEMBL_334048 (CHEMBL862382)
IC50 7000±n/a nM
Citation Baxter, ACooper, AKinchin, EMoakes, KUnitt, JWallace, A Hit-to-Lead studies: the discovery of potent, orally bioavailable thiazolopyrimidine CXCR2 receptor antagonists. Bioorg Med Chem Lett16:960-3 (2006) 
 
C-X-C chemokine receptor type 2
Name:C-X-C chemokine receptor type 2
Type:Protein
Mol. Mass.:40767.88
Organism:Homo sapiens (Human)
Description:P25025
Residue:360
BDBM50177603
NameBDBM50177603
Synonyms:2-(2-amino-5-(pentylthio)thiazolo[4,5-d]pyrimidin-7-ylamino)ethanol | CHEMBL201921
TypeSmall organic molecule
Emp. Form.C12H19N5OS2
Mol. Mass.313.442
SMILESCCCCCSc1nc(NCCO)c2sc(N)nc2n1