Reaction Details
TargetC-X-C chemokine receptor type 2
LigandBDBM50177604
Substrate/Competitorn/a
Meas. Tech.ChEMBL_334048 (CHEMBL862382)
IC50 270±n/a nM
Citation Baxter, ACooper, AKinchin, EMoakes, KUnitt, JWallace, A Hit-to-Lead studies: the discovery of potent, orally bioavailable thiazolopyrimidine CXCR2 receptor antagonists. Bioorg Med Chem Lett16:960-3 (2006) 
 
C-X-C chemokine receptor type 2
Name:C-X-C chemokine receptor type 2
Type:Protein
Mol. Mass.:40767.88
Organism:Homo sapiens (Human)
Description:P25025
Residue:360
BDBM50177604
NameBDBM50177604
Synonyms:5-(2,3-difluorobenzylthio)-2-aminothiazolo[4,5-d]pyrimidin-7-ol | CHEMBL370387
TypeSmall organic molecule
Emp. Form.C12H8F2N4OS2
Mol. Mass.326.345
SMILESNc1nc2nc(SCc3cccc(F)c3F)[nH]c(=O)c2s1