Reaction Details
TargetC-X-C chemokine receptor type 2
LigandBDBM50177610
Substrate/Competitorn/a
Meas. Tech.ChEMBL_334048 (CHEMBL862382)
IC50 10000±n/a nM
Citation Baxter, ACooper, AKinchin, EMoakes, KUnitt, JWallace, A Hit-to-Lead studies: the discovery of potent, orally bioavailable thiazolopyrimidine CXCR2 receptor antagonists. Bioorg Med Chem Lett16:960-3 (2006) 
 
C-X-C chemokine receptor type 2
Name:C-X-C chemokine receptor type 2
Type:Protein
Mol. Mass.:40767.88
Organism:Homo sapiens (Human)
Description:P25025
Residue:360
BDBM50177610
NameBDBM50177610
Synonyms:5-(benzylthio)thiazolo[4,5-d]pyrimidine-2,7-diamine | CHEMBL201800
TypeSmall organic molecule
Emp. Form.C12H11N5S2
Mol. Mass.289.379
SMILESNc1nc2nc(SCc3ccccc3)nc(N)c2s1