Reaction Details
TargetIntegrin alpha-V/beta-3
LigandBDBM50177627
Substrate/Competitorn/a
Meas. Tech.ChEMBL_334206 (CHEMBL866442)
IC50 1.1±n/a nM
Citation Boys, MLSchretzman, LAChandrakumar, NSTollefson, MBMohler, SBDowns, VLPenning, TDRussell, MAWendt, JAChen, BBStenmark, HGWu, HSpangler, DPClare, MDesai, BNKhanna, IKNguyen, MNDuffin, TEngleman, VWFinn, MBFreeman, SKHanneke, MLKeene, JLKlover, JANickols, GANickols, MASteininger, CNWestlin, MWestlin, WYu, YXWang, YDalton, CRNorring, SA Convergent, parallel synthesis of a series of beta-substituted 1,2,4-oxadiazole butanoic acids as potent and selective alpha(v)beta3 receptor antagonists. Bioorg Med Chem Lett16:839-44 (2006) 
 
Integrin alpha-V/beta-3
Name:Integrin alpha-V/beta-3
Type:Enzyme
Mol. Mass.:n/a
Description:n/a
Components:This complex has 2 components.
Component 1
Name:Integrin alpha-V
Synonyms:ITAV_HUMAN Integrin alpha-V/alpha-5 VNRA Vitronectin receptor | Vitronectin receptor subunit alpha
Type:PROTEIN
Mol. Mass.:116024.92
Organism:Homo sapiens (Human)
Description:ChEMBL_582336
Residue:1048
Component 2
Name:Integrin beta-3
Synonyms:CD_antigen=CD61 GPIIIa ITGB3 Platelet membrane glycoprotein IIIa
Type:Protein
Mol. Mass.:87038.91
Organism:Homo sapiens (Human)
Description:P05106
Residue:788
BDBM50177627
NameBDBM50177627
Synonyms:(S)-3-(benzo[d][1,3]dioxol-5-yl)-4-(3-(4-(4-methoxypyridin-2-ylamino)butyl)-1,2,4-oxadiazol-5-yl)butanoic acid | CHEMBL383366
TypeSmall organic molecule
Emp. Form.C23H26N4O6
Mol. Mass.454.4757
SMILESCOc1ccnc(NCCCCc2noc(C[C@@H](CC(O)=O)c3ccc4OCOc4c3)n2)c1