Reaction Details
Target5-hydroxytryptamine receptor 1A
LigandBDBM50130161
Substrate/Competitorn/a
Meas. Tech.ChEMBL_349600 (CHEMBL866277)
Ki 2.76±n/a nM
Citation Takeuchi, KKohn, TJHonigschmidt, NARocco, VPSpinazze, PGHemrick-Luecke, SKThompson, LKEvans, DCRasmussen, KKoger, DLodge, DMartin, LJShaw, JThrelkeld, PGWong, DT Advances toward new antidepressants beyond SSRIs: 1-aryloxy-3-piperidinylpropan-2-ols with dual 5-HT1A receptor antagonism/SSRI activities. Part 5. Bioorg Med Chem Lett16:2347-51 (2006) 
 
5-hydroxytryptamine receptor 1A
Name:5-hydroxytryptamine receptor 1A
Type:n/a
Mol. Mass.:46122.49
Organism:Homo sapiens (Human)
Description:n/a
Residue:422
BDBM50130161
NameBDBM50130161
Synonyms:(S)-1-(1H-Indol-4-yloxy)-3-[(4R,6R)-4-(4-methoxy-benzo[b]thiophen-2-yl)-2-methyl-piperidin-1-yl]-propan-2-ol CHEMBL307874
TypeSmall organic molecule
Emp. Form.C26H30N2O3S
Mol. Mass.450.593
SMILESCOc1cccc2sc(cc12)[C@@H]1CCN(C[C@H](O)COc2cccc3[nH]ccc23)[C@H](C)C1