Reaction Details
TargetMu-type opioid receptor
LigandBDBM50177697
Substrate/Competitorn/a
Meas. Tech.ChEMBL_333513 (CHEMBL866380)
Ki 780±n/a nM
Citation Le Bourdonnec, BGoodman, AJMichaut, MYe, HFGraczyk, TMBelanger, SDeHaven, RNDolle, RE Synthesis and structure-activity relationships of a new series of 2alpha-substituted trans-4,5-dimethyl-4-(3-hydroxyphenyl)piperidine as mu-selective opioid antagonists. Bioorg Med Chem Lett16:864-8 (2006) 
 
Mu-type opioid receptor
Name:Mu-type opioid receptor
Type:G Protein-Coupled Receptor (GPCR)
Mol. Mass.:44789.51
Organism:Homo sapiens (Human)
Description:P35372
Residue:400
BDBM50177697
NameBDBM50177697
Synonyms:3-(2-alpha-(2-aminoethyl)-trans-4,5-dimethyl-1-phenethylpiperidin-4-yl)phenol | CHEMBL201530
TypeSmall organic molecule
Emp. Form.C23H32N2O
Mol. Mass.352.513
SMILESC[C@H]1CN(CCc2ccccc2)[C@H](CCN)C[C@@]1(C)c1cccc(O)c1