Reaction Details
TargetDelta-type opioid receptor
LigandBDBM50177689
Substrate/Competitorn/a
Meas. Tech.ChEMBL_333515 (CHEMBL866454)
Ki 260±n/a nM
Citation Le Bourdonnec, BGoodman, AJMichaut, MYe, HFGraczyk, TMBelanger, SDeHaven, RNDolle, RE Synthesis and structure-activity relationships of a new series of 2alpha-substituted trans-4,5-dimethyl-4-(3-hydroxyphenyl)piperidine as mu-selective opioid antagonists. Bioorg Med Chem Lett16:864-8 (2006) 
 
Delta-type opioid receptor
Name:Delta-type opioid receptor
Type:G Protein-Coupled Receptor (GPCR)
Mol. Mass.:40382.98
Organism:Homo sapiens (Human)
Description:Competition binding assays were carried out using membrane preparations from transfected HN9.10 cells that constitutively expressed the delta opioid receptor.
Residue:372
BDBM50177689
NameBDBM50177689
Synonyms:3-(trans-4,5-dimethyl-1-phenethyl-2-alpha-phenylpiperidin-4-yl)phenol | CHEMBL201480
TypeSmall organic molecule
Emp. Form.C27H31NO
Mol. Mass.385.5411
SMILESC[C@H]1CN(CCc2ccccc2)[C@@H](C[C@@]1(C)c1cccc(O)c1)c1ccccc1