Reaction Details
TargetDelta-type opioid receptor
LigandBDBM50177680
Substrate/Competitorn/a
Meas. Tech.ChEMBL_333515 (CHEMBL866454)
Ki>1000±n/a nM
Citation Le Bourdonnec, BGoodman, AJMichaut, MYe, HFGraczyk, TMBelanger, SDeHaven, RNDolle, RE Synthesis and structure-activity relationships of a new series of 2alpha-substituted trans-4,5-dimethyl-4-(3-hydroxyphenyl)piperidine as mu-selective opioid antagonists. Bioorg Med Chem Lett16:864-8 (2006) 
 
Delta-type opioid receptor
Name:Delta-type opioid receptor
Type:G Protein-Coupled Receptor (GPCR)
Mol. Mass.:40382.98
Organism:Homo sapiens (Human)
Description:Competition binding assays were carried out using membrane preparations from transfected HN9.10 cells that constitutively expressed the delta opioid receptor.
Residue:372
BDBM50177680
NameBDBM50177680
Synonyms:3-(trans-4,5-dimethyl-1-phenethyl-2-alpha-(2-(pyrrolidin-1-yl)ethyl)piperidin-4-yl)phenol | CHEMBL201282
TypeSmall organic molecule
Emp. Form.C27H38N2O
Mol. Mass.406.6034
SMILESC[C@H]1CN(CCc2ccccc2)[C@H](CCN2CCCC2)C[C@@]1(C)c1cccc(O)c1