Reaction Details
TargetDelta-type opioid receptor
LigandBDBM50177694
Substrate/Competitorn/a
Meas. Tech.ChEMBL_333515 (CHEMBL866454)
Ki>1000±n/a nM
Citation Le Bourdonnec, BGoodman, AJMichaut, MYe, HFGraczyk, TMBelanger, SDeHaven, RNDolle, RE Synthesis and structure-activity relationships of a new series of 2alpha-substituted trans-4,5-dimethyl-4-(3-hydroxyphenyl)piperidine as mu-selective opioid antagonists. Bioorg Med Chem Lett16:864-8 (2006) 
 
Delta-type opioid receptor
Name:Delta-type opioid receptor
Type:G Protein-Coupled Receptor (GPCR)
Mol. Mass.:40382.98
Organism:Homo sapiens (Human)
Description:Competition binding assays were carried out using membrane preparations from transfected HN9.10 cells that constitutively expressed the delta opioid receptor.
Residue:372
BDBM50177694
NameBDBM50177694
Synonyms:3-(1-butyl-trans-4,5-dimethyl-2-alpha-propylpiperidin-4-yl)phenol | CHEMBL202150
TypeSmall organic molecule
Emp. Form.C20H33NO
Mol. Mass.303.4821
SMILESCCCCN1C[C@H](C)[C@@](C)(C[C@H]1CCC)c1cccc(O)c1