Reaction Details
TargetKappa-type opioid receptor
LigandBDBM50177689
Substrate/Competitorn/a
Meas. Tech.ChEMBL_333514 (CHEMBL866453)
Ki 290±n/a nM
Citation Le Bourdonnec, BGoodman, AJMichaut, MYe, HFGraczyk, TMBelanger, SDeHaven, RNDolle, RE Synthesis and structure-activity relationships of a new series of 2alpha-substituted trans-4,5-dimethyl-4-(3-hydroxyphenyl)piperidine as mu-selective opioid antagonists. Bioorg Med Chem Lett16:864-8 (2006) 
 
Kappa-type opioid receptor
Name:Kappa-type opioid receptor
Type:G Protein-Coupled Receptor (GPCR)
Mol. Mass.:42648.76
Organism:Homo sapiens (Human)
Description:P41145
Residue:380
BDBM50177689
NameBDBM50177689
Synonyms:3-(trans-4,5-dimethyl-1-phenethyl-2-alpha-phenylpiperidin-4-yl)phenol | CHEMBL201480
TypeSmall organic molecule
Emp. Form.C27H31NO
Mol. Mass.385.5411
SMILESC[C@H]1CN(CCc2ccccc2)[C@@H](C[C@@]1(C)c1cccc(O)c1)c1ccccc1