Reaction Details
TargetKappa-type opioid receptor
LigandBDBM50177695
Substrate/Competitorn/a
Meas. Tech.ChEMBL_333514 (CHEMBL866453)
Ki 57±n/a nM
Citation Le Bourdonnec, BGoodman, AJMichaut, MYe, HFGraczyk, TMBelanger, SDeHaven, RNDolle, RE Synthesis and structure-activity relationships of a new series of 2alpha-substituted trans-4,5-dimethyl-4-(3-hydroxyphenyl)piperidine as mu-selective opioid antagonists. Bioorg Med Chem Lett16:864-8 (2006) 
 
Kappa-type opioid receptor
Name:Kappa-type opioid receptor
Type:G Protein-Coupled Receptor (GPCR)
Mol. Mass.:42648.76
Organism:Homo sapiens (Human)
Description:P41145
Residue:380
BDBM50177695
NameBDBM50177695
Synonyms:3-(1-heptyl-trans-4,5-dimethyl-2-alpha-propylpiperidin-4-yl)phenol | CHEMBL383094
TypeSmall organic molecule
Emp. Form.C23H39NO
Mol. Mass.345.5619
SMILESCCCCCCCN1C[C@H](C)[C@@](C)(C[C@H]1CCC)c1cccc(O)c1