Reaction Details
TargetKappa-type opioid receptor
LigandBDBM50177697
Substrate/Competitorn/a
Meas. Tech.ChEMBL_333514 (CHEMBL866453)
Ki 510±n/a nM
Citation Le Bourdonnec, BGoodman, AJMichaut, MYe, HFGraczyk, TMBelanger, SDeHaven, RNDolle, RE Synthesis and structure-activity relationships of a new series of 2alpha-substituted trans-4,5-dimethyl-4-(3-hydroxyphenyl)piperidine as mu-selective opioid antagonists. Bioorg Med Chem Lett16:864-8 (2006) 
 
Kappa-type opioid receptor
Name:Kappa-type opioid receptor
Type:G Protein-Coupled Receptor (GPCR)
Mol. Mass.:42648.76
Organism:Homo sapiens (Human)
Description:P41145
Residue:380
BDBM50177697
NameBDBM50177697
Synonyms:3-(2-alpha-(2-aminoethyl)-trans-4,5-dimethyl-1-phenethylpiperidin-4-yl)phenol | CHEMBL201530
TypeSmall organic molecule
Emp. Form.C23H32N2O
Mol. Mass.352.513
SMILESC[C@H]1CN(CCc2ccccc2)[C@H](CCN)C[C@@]1(C)c1cccc(O)c1