Reaction Details
TargetMu-type opioid receptor
LigandBDBM50177696
Substrate/Competitorn/a
Meas. Tech.ChEMBL_333516 (CHEMBL866455)
Ki 15±n/a nM
Citation Le Bourdonnec, BGoodman, AJMichaut, MYe, HFGraczyk, TMBelanger, SDeHaven, RNDolle, RE Synthesis and structure-activity relationships of a new series of 2alpha-substituted trans-4,5-dimethyl-4-(3-hydroxyphenyl)piperidine as mu-selective opioid antagonists. Bioorg Med Chem Lett16:864-8 (2006) 
 
Mu-type opioid receptor
Name:Mu-type opioid receptor
Type:G Protein-Coupled Receptor (GPCR)
Mol. Mass.:44789.51
Organism:Homo sapiens (Human)
Description:P35372
Residue:400
BDBM50177696
NameBDBM50177696
Synonyms:3-(2(alpha),4,5(trans)-trimethyl-1-phenethylpiperidin-4-yl)phenol | CHEMBL203307
TypeSmall organic molecule
Emp. Form.C22H29NO
Mol. Mass.323.4718
SMILESC[C@@H]1C[C@](C)([C@@H](C)CN1CCc1ccccc1)c1cccc(O)c1