Reaction Details
TargetMu-type opioid receptor
LigandBDBM50177702
Substrate/Competitorn/a
Meas. Tech.ChEMBL_333516 (CHEMBL866455)
Ki 19±n/a nM
Citation Le Bourdonnec, BGoodman, AJMichaut, MYe, HFGraczyk, TMBelanger, SDeHaven, RNDolle, RE Synthesis and structure-activity relationships of a new series of 2alpha-substituted trans-4,5-dimethyl-4-(3-hydroxyphenyl)piperidine as mu-selective opioid antagonists. Bioorg Med Chem Lett16:864-8 (2006) 
 
Mu-type opioid receptor
Name:Mu-type opioid receptor
Type:G Protein-Coupled Receptor (GPCR)
Mol. Mass.:44789.51
Organism:Homo sapiens (Human)
Description:P35372
Residue:400
BDBM50177702
NameBDBM50177702
Synonyms:3-(trans-4,5-dimethyl-1-(3-phenylpropyl)-2-alpha-propylpiperidin-4-yl)phenol | CHEMBL201661
TypeSmall organic molecule
Emp. Form.C25H35NO
Mol. Mass.365.5515
SMILESCCC[C@@H]1C[C@](C)([C@@H](C)CN1CCCc1ccccc1)c1cccc(O)c1