Reaction Details
TargetMu-type opioid receptor
LigandBDBM50177685
Substrate/Competitorn/a
Meas. Tech.ChEMBL_333516 (CHEMBL866455)
Ki 59±n/a nM
Citation Le Bourdonnec, BGoodman, AJMichaut, MYe, HFGraczyk, TMBelanger, SDeHaven, RNDolle, RE Synthesis and structure-activity relationships of a new series of 2alpha-substituted trans-4,5-dimethyl-4-(3-hydroxyphenyl)piperidine as mu-selective opioid antagonists. Bioorg Med Chem Lett16:864-8 (2006) 
 
Mu-type opioid receptor
Name:Mu-type opioid receptor
Type:G Protein-Coupled Receptor (GPCR)
Mol. Mass.:44789.51
Organism:Homo sapiens (Human)
Description:P35372
Residue:400
BDBM50177685
NameBDBM50177685
Synonyms:CHEMBL201845 | N-(2-(4-(3-hydroxyphenyl)-trans-4,5-dimethyl-1-phenethylpiperidin-2(alpha)-yl)ethyl)benzamide
TypeSmall organic molecule
Emp. Form.C30H36N2O2
Mol. Mass.456.619
SMILESC[C@H]1CN(CCc2ccccc2)[C@H](CCNC(=O)c2ccccc2)C[C@@]1(C)c1cccc(O)c1