Reaction Details
TargetKappa-type opioid receptor
LigandBDBM50177687
Substrate/Competitorn/a
Meas. Tech.ChEMBL_333514 (CHEMBL866453)
Ki 360±n/a nM
Citation Le Bourdonnec, BGoodman, AJMichaut, MYe, HFGraczyk, TMBelanger, SDeHaven, RNDolle, RE Synthesis and structure-activity relationships of a new series of 2alpha-substituted trans-4,5-dimethyl-4-(3-hydroxyphenyl)piperidine as mu-selective opioid antagonists. Bioorg Med Chem Lett16:864-8 (2006) 
 
Kappa-type opioid receptor
Name:Kappa-type opioid receptor
Type:G Protein-Coupled Receptor (GPCR)
Mol. Mass.:42648.76
Organism:Homo sapiens (Human)
Description:P41145
Residue:380
BDBM50177687
NameBDBM50177687
Synonyms:3-(1-benzyl-4,5-trans-dimethyl-2-alpha-propylpiperidin-4-yl)phenol | CHEMBL201296
TypeSmall organic molecule
Emp. Form.C23H31NO
Mol. Mass.337.4983
SMILESCCC[C@@H]1C[C@](C)([C@@H](C)CN1Cc1ccccc1)c1cccc(O)c1