Reaction Details
TargetKappa-type opioid receptor
LigandBDBM50177701
Substrate/Competitorn/a
Meas. Tech.ChEMBL_333514 (CHEMBL866453)
Ki 110±n/a nM
Citation Le Bourdonnec, BGoodman, AJMichaut, MYe, HFGraczyk, TMBelanger, SDeHaven, RNDolle, RE Synthesis and structure-activity relationships of a new series of 2alpha-substituted trans-4,5-dimethyl-4-(3-hydroxyphenyl)piperidine as mu-selective opioid antagonists. Bioorg Med Chem Lett16:864-8 (2006) 
 
Kappa-type opioid receptor
Name:Kappa-type opioid receptor
Type:G Protein-Coupled Receptor (GPCR)
Mol. Mass.:42648.76
Organism:Homo sapiens (Human)
Description:P41145
Residue:380
BDBM50177701
NameBDBM50177701
Synonyms:3-(trans-4,5-dimethyl-1-phenethyl-2-alpha-propylpiperidin-4-yl)phenol | CHEMBL382919
TypeSmall organic molecule
Emp. Form.C24H33NO
Mol. Mass.351.5249
SMILESCCC[C@@H]1C[C@](C)([C@@H](C)CN1CCc1ccccc1)c1cccc(O)c1