Reaction Details
TargetCathepsin S
LigandBDBM50177771
Substrate/Competitorn/a
Meas. Tech.ChEMBL_325795 (CHEMBL862701)
Ki 3900±n/a nM
Citation Palmer, JTBryant, CWang, DXDavis, DESetti, ELRydzewski, RMVenkatraman, STian, ZQBurrill, LCMendonca, RVSpringman, EMcCarter, JChung, TCheung, HJanc, JWMcGrath, MSomoza, JREnriquez, PYu, ZWStrickley, RMLiu, LVenuti, MCPercival, MDFalgueyret, JPPrasit, POballa, RRiendeau, DYoung, RNWesolowski, GRodan, SBJohnson, CKimmel, DBRodan, G Design and synthesis of tri-ring P3 benzamide-containing aminonitriles as potent, selective, orally effective inhibitors of cathepsin K. J Med Chem48:7520-34 (2005) 
 
Cathepsin S
Name:Cathepsin S
Type:Protein
Mol. Mass.:37507.38
Organism:Homo sapiens (Human)
Description:P25774
Residue:331
BDBM50177771
NameBDBM50177771
Synonyms:4'-(4-tert-Butylamino-piperidin-1-yl)-biphenyl-4-carboxylic acid [1-(cyanomethyl-carbamoyl)-cyclohexyl]-amide | CHEMBL199163
TypeSmall organic molecule
Emp. Form.C31H41N5O2
Mol. Mass.515.6895
SMILESCC(C)(C)NC1CCN(CC1)c1ccc(cc1)-c1ccc(cc1)C(=O)NC1(CCCCC1)C(=O)NCC#N