Reaction Details
TargetCathepsin K
LigandBDBM50410577
Substrate/Competitorn/a
Meas. Tech.ChEMBL_325792 (CHEMBL862698)
Ki 1500±n/a nM
Citation Palmer, JTBryant, CWang, DXDavis, DESetti, ELRydzewski, RMVenkatraman, STian, ZQBurrill, LCMendonca, RVSpringman, EMcCarter, JChung, TCheung, HJanc, JWMcGrath, MSomoza, JREnriquez, PYu, ZWStrickley, RMLiu, LVenuti, MCPercival, MDFalgueyret, JPPrasit, POballa, RRiendeau, DYoung, RNWesolowski, GRodan, SBJohnson, CKimmel, DBRodan, G Design and synthesis of tri-ring P3 benzamide-containing aminonitriles as potent, selective, orally effective inhibitors of cathepsin K. J Med Chem48:7520-34 (2005) 
 
Cathepsin K
Name:Cathepsin K
Type:Enzyme
Mol. Mass.:36879.51
Organism:Oryctolagus cuniculus (rabbit)
Description:n/a
Residue:329
BDBM50410577
NameBDBM50410577
Synonyms:CHEMBL372140
TypeSmall organic molecule
Emp. Form.C16H19N3O3
Mol. Mass.301.3404
SMILESO=C(NC1(CCCC1)C(=O)NCC#N)OCc1ccccc1