Reaction Details
TargetVascular endothelial growth factor receptor 2
LigandBDBM50002588
Substrate/Competitorn/a
Meas. Tech.ChEMBL_326138 (CHEMBL864514)
IC50 3.8±n/a nM
Citation Wissner, AFloyd, MBJohnson, BDFraser, HIngalls, CNittoli, TDushin, RGDiscafani, CNilakantan, RMarini, JRavi, MCheung, KTan, XMusto, SAnnable, TSiegel, MMLoganzo, F 2-(Quinazolin-4-ylamino)-[1,4]benzoquinones as covalent-binding, irreversible inhibitors of the kinase domain of vascular endothelial growth factor receptor-2. J Med Chem48:7560-81 (2005) 
 
Vascular endothelial growth factor receptor 2
Name:Vascular endothelial growth factor receptor 2
Type:Receptor Tyrosine Kinase
Mol. Mass.:151510.97
Organism:Homo sapiens (Human)
Description:P35968
Residue:1356
BDBM50002588
NameBDBM50002588
Synonyms:CHEMBL2113183
TypeSmall organic molecule
Emp. Form.C19H19N3O6
Mol. Mass.385.3707
SMILESCOCCOc1cc2ncnc(NC3=CC(=O)C=C(OC)C3=O)c2cc1OC