Reaction Details
TargetVascular endothelial growth factor receptor 2
LigandBDBM50177848
Substrate/Competitorn/a
Meas. Tech.ChEMBL_326140 (CHEMBL862695)
IC50 97±n/a nM
Citation Wissner, AFloyd, MBJohnson, BDFraser, HIngalls, CNittoli, TDushin, RGDiscafani, CNilakantan, RMarini, JRavi, MCheung, KTan, XMusto, SAnnable, TSiegel, MMLoganzo, F 2-(Quinazolin-4-ylamino)-[1,4]benzoquinones as covalent-binding, irreversible inhibitors of the kinase domain of vascular endothelial growth factor receptor-2. J Med Chem48:7560-81 (2005) 
 
Vascular endothelial growth factor receptor 2
Name:Vascular endothelial growth factor receptor 2
Type:Receptor Tyrosine Kinase
Mol. Mass.:151510.97
Organism:Homo sapiens (Human)
Description:P35968
Residue:1356
BDBM50177848
NameBDBM50177848
Synonyms:2-Chloro-3-isopropoxy-5-{[6-methoxy-7-(2-methoxyethoxy)quinazolin-4-yl]amino}benzo-1,4-quinone | CHEMBL200681
TypeSmall organic molecule
Emp. Form.C21H22ClN3O6
Mol. Mass.447.869
SMILESCOCCOc1cc2ncnc(N=C3CC(=O)C(Cl)=C(OC(C)C)C3=O)c2cc1OC