Reaction Details
TargetVascular endothelial growth factor receptor 2
LigandBDBM50177836
Substrate/Competitorn/a
Meas. Tech.ChEMBL_326140 (CHEMBL862695)
IC50 118±n/a nM
Citation Wissner, AFloyd, MBJohnson, BDFraser, HIngalls, CNittoli, TDushin, RGDiscafani, CNilakantan, RMarini, JRavi, MCheung, KTan, XMusto, SAnnable, TSiegel, MMLoganzo, F 2-(Quinazolin-4-ylamino)-[1,4]benzoquinones as covalent-binding, irreversible inhibitors of the kinase domain of vascular endothelial growth factor receptor-2. J Med Chem48:7560-81 (2005) 
 
Vascular endothelial growth factor receptor 2
Name:Vascular endothelial growth factor receptor 2
Type:Receptor Tyrosine Kinase
Mol. Mass.:151510.97
Organism:Homo sapiens (Human)
Description:P35968
Residue:1356
BDBM50177836
NameBDBM50177836
Synonyms:2-{[6-Methoxy-7-(2-methoxyethoxy)quinazolin-4-yl]amino}-5-(2-phenoxyethoxy)benzo-1,4-quinone | CHEMBL200324
TypeSmall organic molecule
Emp. Form.C26H25N3O7
Mol. Mass.491.4926
SMILESCOCCOc1cc2ncnc(N=C3CC(=O)C(OCCOc4ccccc4)=CC3=O)c2cc1OC