Reaction Details
TargetVascular endothelial growth factor receptor 2
LigandBDBM50002577
Substrate/Competitorn/a
Meas. Tech.ChEMBL_326139 (CHEMBL864515)
IC50 5.1±n/a nM
Citation Wissner, AFloyd, MBJohnson, BDFraser, HIngalls, CNittoli, TDushin, RGDiscafani, CNilakantan, RMarini, JRavi, MCheung, KTan, XMusto, SAnnable, TSiegel, MMLoganzo, F 2-(Quinazolin-4-ylamino)-[1,4]benzoquinones as covalent-binding, irreversible inhibitors of the kinase domain of vascular endothelial growth factor receptor-2. J Med Chem48:7560-81 (2005) 
 
Vascular endothelial growth factor receptor 2
Name:Vascular endothelial growth factor receptor 2
Type:Receptor Tyrosine Kinase
Mol. Mass.:151510.97
Organism:Homo sapiens (Human)
Description:P35968
Residue:1356
BDBM50002577
NameBDBM50002577
Synonyms:CHEMBL2113163
TypeSmall organic molecule
Emp. Form.C27H28N4O6
Mol. Mass.504.5344
SMILESCOc1cc2c(NC3=CC(=O)C(OCc4ccco4)=CC3=O)ncnc2cc1OCCCN1CCCC1