Reaction Details
TargetVascular endothelial growth factor receptor 2
LigandBDBM50177835
Substrate/Competitorn/a
Meas. Tech.ChEMBL_326140 (CHEMBL862695)
IC50 4.8±n/a nM
Citation Wissner, AFloyd, MBJohnson, BDFraser, HIngalls, CNittoli, TDushin, RGDiscafani, CNilakantan, RMarini, JRavi, MCheung, KTan, XMusto, SAnnable, TSiegel, MMLoganzo, F 2-(Quinazolin-4-ylamino)-[1,4]benzoquinones as covalent-binding, irreversible inhibitors of the kinase domain of vascular endothelial growth factor receptor-2. J Med Chem48:7560-81 (2005) 
 
Vascular endothelial growth factor receptor 2
Name:Vascular endothelial growth factor receptor 2
Type:Receptor Tyrosine Kinase
Mol. Mass.:151510.97
Organism:Homo sapiens (Human)
Description:P35968
Residue:1356
BDBM50177835
NameBDBM50177835
Synonyms:2-{[6-Methoxy-7-(3-pyrrolidin-1-ylpropoxy)quinazolin-4-yl]amino}-5-(prop-2-yn-1-yloxy)benzo-1,4-quinone | CHEMBL198744
TypeSmall organic molecule
Emp. Form.C25H26N4O5
Mol. Mass.462.4977
SMILESCOc1cc2c(N=C3CC(=O)C(OCC#C)=CC3=O)ncnc2cc1OCCCN1CCCC1