Reaction Details
TargetVascular endothelial growth factor receptor 2
LigandBDBM50177817
Substrate/Competitorn/a
Meas. Tech.ChEMBL_326139 (CHEMBL864515)
IC50 4.5±n/a nM
Citation Wissner, AFloyd, MBJohnson, BDFraser, HIngalls, CNittoli, TDushin, RGDiscafani, CNilakantan, RMarini, JRavi, MCheung, KTan, XMusto, SAnnable, TSiegel, MMLoganzo, F 2-(Quinazolin-4-ylamino)-[1,4]benzoquinones as covalent-binding, irreversible inhibitors of the kinase domain of vascular endothelial growth factor receptor-2. J Med Chem48:7560-81 (2005) 
 
Vascular endothelial growth factor receptor 2
Name:Vascular endothelial growth factor receptor 2
Type:Receptor Tyrosine Kinase
Mol. Mass.:151510.97
Organism:Homo sapiens (Human)
Description:P35968
Residue:1356
BDBM50177817
NameBDBM50177817
Synonyms:2-{[6-Methoxy-7-(3-pyrrolidin-1-ylpropoxy)quinazolin-4-yl]amino}-5-[(penta fluorobenzyl)oxy]benzo-1,4-quinone | CHEMBL370356
TypeSmall organic molecule
Emp. Form.C29H25F5N4O5
Mol. Mass.604.5246
SMILESCOc1cc2c(N=C3CC(=O)C(OCc4c(F)c(F)c(F)c(F)c4F)=CC3=O)ncnc2cc1OCCCN1CCCC1