Reaction Details
TargetVascular endothelial growth factor receptor 2
LigandBDBM50177834
Substrate/Competitorn/a
Meas. Tech.ChEMBL_326142 (CHEMBL862697)
IC50 3.00±n/a nM
Citation Wissner, AFloyd, MBJohnson, BDFraser, HIngalls, CNittoli, TDushin, RGDiscafani, CNilakantan, RMarini, JRavi, MCheung, KTan, XMusto, SAnnable, TSiegel, MMLoganzo, F 2-(Quinazolin-4-ylamino)-[1,4]benzoquinones as covalent-binding, irreversible inhibitors of the kinase domain of vascular endothelial growth factor receptor-2. J Med Chem48:7560-81 (2005) 
 
Vascular endothelial growth factor receptor 2
Name:Vascular endothelial growth factor receptor 2
Type:Receptor Tyrosine Kinase
Mol. Mass.:151510.97
Organism:Homo sapiens (Human)
Description:P35968
Residue:1356
BDBM50177834
NameBDBM50177834
Synonyms:2-Methoxy-5-{[6-methoxy-7-(3-pyrrolidin-1-ylpropoxy)quinazolin-4-yl]amino}benzo-1,4-quinone | CHEMBL199455
TypeSmall organic molecule
Emp. Form.C23H26N4O5
Mol. Mass.438.4763
SMILESCOC1=CC(=O)C(Nc2ncnc3cc(OCCCN4CCCC4)c(OC)cc23)=CC1=O