Reaction Details
TargetVascular endothelial growth factor receptor 2
LigandBDBM50177797
Substrate/Competitorn/a
Meas. Tech.ChEMBL_326138 (CHEMBL864514)
IC50 5.8±n/a nM
Citation Wissner, AFloyd, MBJohnson, BDFraser, HIngalls, CNittoli, TDushin, RGDiscafani, CNilakantan, RMarini, JRavi, MCheung, KTan, XMusto, SAnnable, TSiegel, MMLoganzo, F 2-(Quinazolin-4-ylamino)-[1,4]benzoquinones as covalent-binding, irreversible inhibitors of the kinase domain of vascular endothelial growth factor receptor-2. J Med Chem48:7560-81 (2005) 
 
Vascular endothelial growth factor receptor 2
Name:Vascular endothelial growth factor receptor 2
Type:Receptor Tyrosine Kinase
Mol. Mass.:151510.97
Organism:Homo sapiens (Human)
Description:P35968
Residue:1356
BDBM50177797
NameBDBM50177797
Synonyms:2-{[6-Methoxy-7-(2-methoxyethoxy)quinazolin-4-yl]amino}-5-[(pentafluorobenzyl)oxy]benzo-1,4-quinone | CHEMBL198973
TypeSmall organic molecule
Emp. Form.C25H18F5N3O6
Mol. Mass.551.4189
SMILESCOCCOc1cc2ncnc(N=C3CC(=O)C(OCc4c(F)c(F)c(F)c(F)c4F)=CC3=O)c2cc1OC