Reaction Details
TargetDynamin-1
LigandBDBM4363
Substrate/Competitorn/a
Meas. Tech.ChEMBL_326472 (CHEMBL864467)
IC50 70000±n/a nM
Citation Hill, TOdell, LREdwards, JKGraham, MEMcGeachie, ABRusak, JQuan, AAbagyan, RScott, JLRobinson, PJMcCluskey, A Small molecule inhibitors of dynamin I GTPase activity: development of dimeric tyrphostins. J Med Chem48:7781-8 (2005) 
 
Dynamin-1
Name:Dynamin-1
Type:PROTEIN
Mol. Mass.:97411.67
Organism:Homo sapiens (Human)
Description:ChEMBL_1458576
Residue:864
BDBM4363
NameBDBM4363
Synonyms:(2E)-2-cyano-3-(3,4-dihydroxyphenyl)prop-2-enethioamide CHEMBL77030 T7540 (Tyrphostin 47) alpha-Cyano-(3,4-dihydroxy)thiocinnamide | benzylidenemalononitrile (BMN) deriv. 47
TypeSmall organic molecule
Emp. Form.C10H8N2O2S
Mol. Mass.220.248
SMILESNC(=S)C(=C\c1ccc(O)c(O)c1)\C#N