Reaction Details
TargetNAD-dependent histone deacetylase SIR2
LigandBDBM50156760
Substrate/Competitorn/a
Meas. Tech.ChEMBL_326721 (CHEMBL859799)
IC50 48000±n/a nM
Citation Mai, AMassa, SLavu, SPezzi, RSimeoni, SRagno, RMariotti, FRChiani, FCamilloni, GSinclair, DA Design, synthesis, and biological evaluation of sirtinol analogues as class III histone/protein deacetylase (Sirtuin) inhibitors. J Med Chem48:7789-95 (2005) 
 
NAD-dependent histone deacetylase SIR2
Name:NAD-dependent histone deacetylase SIR2
Type:PROTEIN
Mol. Mass.:63277.80
Organism:Saccharomyces cerevisiae
Description:ChEMBL_942450
Residue:562
BDBM50156760
NameBDBM50156760
Synonyms:(E)-2-((2-hydroxynaphthalen-1-yl)methyleneamino)-N-(1-phenylethyl)benzamide 2-{[(1-(2-hydroxy-naphthalen-1-yl)meth-(E)-ylidene]amino}-N-(1-phenylethyl)-benzamide CHEMBL380797 | Sirtinol
TypeSmall organic molecule
Emp. Form.C26H22N2O2
Mol. Mass.394.4651
SMILESCC(NC(=O)c1ccccc1\N=C\c1c(O)ccc2ccccc12)c1ccccc1