Reaction Details
TargetNAD-dependent histone deacetylase SIR2
LigandBDBM50177984
Substrate/Competitorn/a
Meas. Tech.ChEMBL_326721 (CHEMBL859799)
IC50 33000±n/a nM
Citation Mai, AMassa, SLavu, SPezzi, RSimeoni, SRagno, RMariotti, FRChiani, FCamilloni, GSinclair, DA Design, synthesis, and biological evaluation of sirtinol analogues as class III histone/protein deacetylase (Sirtuin) inhibitors. J Med Chem48:7789-95 (2005) 
 
NAD-dependent histone deacetylase SIR2
Name:NAD-dependent histone deacetylase SIR2
Type:PROTEIN
Mol. Mass.:63277.80
Organism:Saccharomyces cerevisiae
Description:ChEMBL_942450
Residue:562
BDBM50177984
NameBDBM50177984
Synonyms:CHEMBL372375 | para-Sirtinol
TypeSmall organic molecule
Emp. Form.C26H22N2O2
Mol. Mass.394.4651
SMILESCC(NC(=O)c1ccc(cc1)\N=C\c1c(O)ccc2ccccc12)c1ccccc1