Reaction Details
TargetAdenosine kinase
LigandBDBM50090895
Substrate/Competitorn/a
Meas. Tech.ChEMBL_325687 (CHEMBL864546)
IC50 1.5±n/a nM
Citation Bookser, BCUgarkar, BGMatelich, MCLemus, RHAllan, MTsuchiya, MNakane, MNagahisa, AWiesner, JBErion, MD Adenosine kinase inhibitors. 6. Synthesis, water solubility, and antinociceptive activity of 5-phenyl-7-(5-deoxy-beta-D-ribofuranosyl)pyrrolo[2,3-d]pyrimidines substituted at C4 with glycinamides and related compounds. J Med Chem48:7808-20 (2005) 
 
Adenosine kinase
Name:Adenosine kinase
Type:PROTEIN
Mol. Mass.:40545.97
Organism:Homo sapiens (Human)
Description:ChEMBL_1467841
Residue:362
BDBM50090895
NameBDBM50090895
Synonyms:(2R,3R,4S,5R)-2-[4-(4-Fluoro-phenylamino)-5-phenyl-pyrrolo[2,3-d]pyrimidin-7-yl]-5-methyl-tetrahydro-furan-3,4-diol 2-[4-(4-Fluoro-phenylamino)-5-phenyl-pyrrolo[2,3-d]pyrimidin-7-yl]-5-methyl-tetrahydro-furan-3,4-diol CHEMBL66277
TypeSmall organic molecule
Emp. Form.C23H21FN4O3
Mol. Mass.420.4362
SMILESC[C@H]1O[C@H]([C@H](O)[C@@H]1O)n1cc(-c2ccccc2)c2c(Nc3ccc(F)cc3)ncnc12