Reaction Details
TargetAdenosine kinase
LigandBDBM50178007
Substrate/Competitorn/a
Meas. Tech.ChEMBL_325687 (CHEMBL864546)
IC50 0.6±n/a nM
Citation Bookser, BCUgarkar, BGMatelich, MCLemus, RHAllan, MTsuchiya, MNakane, MNagahisa, AWiesner, JBErion, MD Adenosine kinase inhibitors. 6. Synthesis, water solubility, and antinociceptive activity of 5-phenyl-7-(5-deoxy-beta-D-ribofuranosyl)pyrrolo[2,3-d]pyrimidines substituted at C4 with glycinamides and related compounds. J Med Chem48:7808-20 (2005) 
 
Adenosine kinase
Name:Adenosine kinase
Type:PROTEIN
Mol. Mass.:40545.97
Organism:Homo sapiens (Human)
Description:ChEMBL_1467841
Residue:362
BDBM50178007
NameBDBM50178007
Synonyms:2-(5-phenyl-7-(beta-D-erythrofuranosyl)-pyrrolo[2,3-d]pyrimidin-4-ylamino)-N-phenylacetamide | CHEMBL200169
TypeSmall organic molecule
Emp. Form.C24H23N5O4
Mol. Mass.445.4705
SMILESO[C@@H]1CO[C@H]([C@@H]1O)n1cc(-c2ccccc2)c2c(NCC(=O)Nc3ccccc3)ncnc12