Reaction Details
TargetIntegrin alpha-V/beta-3
LigandBDBM50178254
Substrate/Competitorn/a
Meas. Tech.ChEMBL_333489 (CHEMBL867096)
IC50 0.61±n/a nM
Citation Wendt, JAWu, HStenmark, HGBoys, MLDowns, VLPenning, TDChen, BBWang, YDuffin, TFinn, MBKeene, JLEngleman, VWFreeman, SKHanneke, MLShannon, KENickols, MASteininger, CNWestlin, MKlover, JAWestlin, WNickols, GARussell, MA Synthesis of 2,5-thiazole butanoic acids as potent and selective alpha(v)beta3 integrin receptor antagonists with improved oral pharmacokinetic properties. Bioorg Med Chem Lett16:845-9 (2006) 
 
Integrin alpha-V/beta-3
Name:Integrin alpha-V/beta-3
Type:Enzyme
Mol. Mass.:n/a
Description:n/a
Components:This complex has 2 components.
Component 1
Name:Integrin alpha-V
Synonyms:ITAV_HUMAN Integrin alpha-V/alpha-5 VNRA Vitronectin receptor | Vitronectin receptor subunit alpha
Type:PROTEIN
Mol. Mass.:116024.92
Organism:Homo sapiens (Human)
Description:ChEMBL_582336
Residue:1048
Component 2
Name:Integrin beta-3
Synonyms:CD_antigen=CD61 GPIIIa ITGB3 Platelet membrane glycoprotein IIIa
Type:Protein
Mol. Mass.:87038.91
Organism:Homo sapiens (Human)
Description:P05106
Residue:788
BDBM50178254
NameBDBM50178254
Synonyms:3-(benzo[d][1,3]dioxol-5-yl)-4-(2-(3-(1-methyl-1,2,3,4-tetrahydropyrido[3,2-b]pyrazin-6-yl)propyl)thiazol-4-yl)butanoic acid | CHEMBL202530
TypeSmall organic molecule
Emp. Form.C25H28N4O4S
Mol. Mass.480.579
SMILESCN1CCNc2nc(CCCc3nc(CC(CC(O)=O)c4ccc5OCOc5c4)cs3)ccc12