Reaction Details
TargetFibroblast growth factor receptor 1
LigandBDBM50178493
Substrate/Competitorn/a
Meas. Tech.ChEMBL_331143 (CHEMBL862244)
IC50>50000±n/a nM
Citation Lee, KIPark, YPark, SJHwang, JHLee, SJKim, GDPark, WKLee, SJeong, DKong, JYKang, HKCho, H Naphthofuroquinone derivatives: inhibition of receptor tyrosine kinases. Bioorg Med Chem Lett16:737-42 (2005) 
 
Fibroblast growth factor receptor 1
Name:Fibroblast growth factor receptor 1
Type:Receptor
Mol. Mass.:91861.70
Organism:Homo sapiens (Human)
Description:P11362
Residue:822
BDBM50178493
NameBDBM50178493
Synonyms:5-methoxy-7,12-dioxo-7,12-dihydro-dinaphtho[1,2-b;2',3'-d]furan-6-carboxylic acid methyl ester | CHEMBL201840
TypeSmall organic molecule
Emp. Form.C23H14O6
Mol. Mass.386.3537
SMILESCOC(=O)c1c(OC)c2ccccc2c2oc3c(C(=O)c4ccccc4C3=O)c12