Reaction Details
TargetPlatelet-derived growth factor receptor beta
LigandBDBM50178496
Substrate/Competitorn/a
Meas. Tech.ChEMBL_331144 (CHEMBL862245)
IC50>50000±n/a nM
Citation Lee, KIPark, YPark, SJHwang, JHLee, SJKim, GDPark, WKLee, SJeong, DKong, JYKang, HKCho, H Naphthofuroquinone derivatives: inhibition of receptor tyrosine kinases. Bioorg Med Chem Lett16:737-42 (2005) 
 
Platelet-derived growth factor receptor beta
Name:Platelet-derived growth factor receptor beta
Type:Enzyme
Mol. Mass.:123922.25
Organism:Homo sapiens (Human)
Description:P09619
Residue:1106
BDBM50178496
NameBDBM50178496
Synonyms:7,12-dioxo-5-propoxy-7,12-dihydro-dinaphtho[1,2-b;2',3'-d]furan-6-carboxylic acid methyl ester | CHEMBL202216
TypeSmall organic molecule
Emp. Form.C25H18O6
Mol. Mass.414.4068
SMILESCCCOc1c(C(=O)OC)c2c3c(oc2c2ccccc12)C(=O)c1ccccc1C3=O