Reaction Details
TargetAmyloid-beta precursor protein
LigandBDBM25849
Substrate/Competitorn/a
Meas. Tech.ChEMBL_339444 (CHEMBL866523)
Ki 4±n/a nM
Citation Chandra, RKung, MPKung, HF Design, synthesis, and structure-activity relationship of novel thiophene derivatives for beta-amyloid plaque imaging. Bioorg Med Chem Lett16:1350-2 (2006) 
 
Amyloid-beta precursor protein
Name:Amyloid-beta precursor protein
Type:Single-pass type I membrane protein
Mol. Mass.:86890.41
Organism:Homo sapiens (Human)
Description:P05067
Residue:770
BDBM25849
NameBDBM25849
Synonyms:4-[5-(4-hydroxyphenyl)thiophen-2-yl]phenol hydroxyphenyl substituted thiophene, 21
TypeSmall organic molecule
Emp. Form.C16H12O2S
Mol. Mass.268.33
SMILESOc1ccc(cc1)-c1ccc(s1)-c1ccc(O)cc1