Reaction Details
TargetSubstance-P receptor
LigandBDBM50178550
Substrate/Competitorn/a
Meas. Tech.ChEMBL_337893 (CHEMBL868375)
Ki 724±n/a nM
Citation Hoffmann, TBös, MStadler, HSchnider, PHunkeler, WGodel, TGalley, GBallard, TMHiggins, GAPoli, SMSleight, AJ Design and synthesis of a novel, achiral class of highly potent and selective, orally active neurokinin-1 receptor antagonists. Bioorg Med Chem Lett16:1362-5 (2006) 
 
Substance-P receptor
Name:Substance-P receptor
Type:G Protein-Coupled Receptor (GPCR)
Mol. Mass.:46254.43
Organism:Homo sapiens (Human)
Description:P25103
Residue:407
BDBM50178550
NameBDBM50178550
Synonyms:CHEMBL438801 | biphenyl-2-ylmethyl-(3,5-bis-trifluoromethyl-benzyl)-methyl-amine
TypeSmall organic molecule
Emp. Form.C23H19F6N
Mol. Mass.423.3941
SMILESCN(Cc1cc(cc(c1)C(F)(F)F)C(F)(F)F)Cc1ccccc1-c1ccccc1