Reaction Details
TargetSubstance-P receptor
LigandBDBM50178556
Substrate/Competitorn/a
Meas. Tech.ChEMBL_337893 (CHEMBL868375)
Ki 562±n/a nM
Citation Hoffmann, TBös, MStadler, HSchnider, PHunkeler, WGodel, TGalley, GBallard, TMHiggins, GAPoli, SMSleight, AJ Design and synthesis of a novel, achiral class of highly potent and selective, orally active neurokinin-1 receptor antagonists. Bioorg Med Chem Lett16:1362-5 (2006) 
 
Substance-P receptor
Name:Substance-P receptor
Type:G Protein-Coupled Receptor (GPCR)
Mol. Mass.:46254.43
Organism:Homo sapiens (Human)
Description:P25103
Residue:407
BDBM50178556
NameBDBM50178556
Synonyms:CHEMBL381744 | N-biphenyl-2-yl-2-(3,5-bis-trifluoromethyl-phenyl)-N-methyl-acetamide
TypeSmall organic molecule
Emp. Form.C23H17F6NO
Mol. Mass.437.3776
SMILESCN(C(=O)Cc1cc(cc(c1)C(F)(F)F)C(F)(F)F)c1ccccc1-c1ccccc1