Reaction Details
TargetSubstance-P receptor
LigandBDBM50178558
Substrate/Competitorn/a
Meas. Tech.ChEMBL_337893 (CHEMBL868375)
Ki 0.44±n/a nM
Citation Hoffmann, TBös, MStadler, HSchnider, PHunkeler, WGodel, TGalley, GBallard, TMHiggins, GAPoli, SMSleight, AJ Design and synthesis of a novel, achiral class of highly potent and selective, orally active neurokinin-1 receptor antagonists. Bioorg Med Chem Lett16:1362-5 (2006) 
 
Substance-P receptor
Name:Substance-P receptor
Type:G Protein-Coupled Receptor (GPCR)
Mol. Mass.:46254.43
Organism:Homo sapiens (Human)
Description:P25103
Residue:407
BDBM50178558
NameBDBM50178558
Synonyms:2-(3,5-bis(trifluoromethyl)phenyl)-N,2-dimethyl-N-(2-(4-methylpiperazin-1-yl)-4-o-tolylpyrimidin-5-yl)propanamide | CHEMBL203867
TypeSmall organic molecule
Emp. Form.C29H31F6N5O
Mol. Mass.579.5798
SMILESCN(C(=O)C(C)(C)c1cc(cc(c1)C(F)(F)F)C(F)(F)F)c1cnc(nc1-c1ccccc1C)N1CCN(C)CC1