Reaction Details
TargetSubstance-P receptor
LigandBDBM50178564
Substrate/Competitorn/a
Meas. Tech.ChEMBL_337893 (CHEMBL868375)
Ki 174±n/a nM
Citation Hoffmann, TBös, MStadler, HSchnider, PHunkeler, WGodel, TGalley, GBallard, TMHiggins, GAPoli, SMSleight, AJ Design and synthesis of a novel, achiral class of highly potent and selective, orally active neurokinin-1 receptor antagonists. Bioorg Med Chem Lett16:1362-5 (2006) 
 
Substance-P receptor
Name:Substance-P receptor
Type:G Protein-Coupled Receptor (GPCR)
Mol. Mass.:46254.43
Organism:Homo sapiens (Human)
Description:P25103
Residue:407
BDBM50178564
NameBDBM50178564
Synonyms:CHEMBL425768 | N-[1-(2'-chloro-biphenyl-2-yl)-methylidene]-N'-(3,5-dichloro-pyridin-4-yl)-hydrazine
TypeSmall organic molecule
Emp. Form.C18H12Cl3N3
Mol. Mass.376.667
SMILESClc1ccccc1-c1ccccc1CN=Nc1c(Cl)cncc1Cl