Reaction Details
TargetSubstance-P receptor
LigandBDBM50178569
Substrate/Competitorn/a
Meas. Tech.ChEMBL_337893 (CHEMBL868375)
Ki>10000±n/a nM
Citation Hoffmann, TBös, MStadler, HSchnider, PHunkeler, WGodel, TGalley, GBallard, TMHiggins, GAPoli, SMSleight, AJ Design and synthesis of a novel, achiral class of highly potent and selective, orally active neurokinin-1 receptor antagonists. Bioorg Med Chem Lett16:1362-5 (2006) 
 
Substance-P receptor
Name:Substance-P receptor
Type:G Protein-Coupled Receptor (GPCR)
Mol. Mass.:46254.43
Organism:Homo sapiens (Human)
Description:P25103
Residue:407
BDBM50178569
NameBDBM50178569
Synonyms:CHEMBL382989 | biphenyl-2-carboxylic acid 3,5-bis-trifluoromethyl-benzylamide
TypeSmall organic molecule
Emp. Form.C22H15F6NO
Mol. Mass.423.351
SMILESFC(F)(F)c1cc(CNC(=O)c2ccccc2-c2ccccc2)cc(c1)C(F)(F)F