Reaction Details
TargetSubstance-P receptor
LigandBDBM50178573
Substrate/Competitorn/a
Meas. Tech.ChEMBL_337893 (CHEMBL868375)
Ki 6.2±n/a nM
Citation Hoffmann, TBös, MStadler, HSchnider, PHunkeler, WGodel, TGalley, GBallard, TMHiggins, GAPoli, SMSleight, AJ Design and synthesis of a novel, achiral class of highly potent and selective, orally active neurokinin-1 receptor antagonists. Bioorg Med Chem Lett16:1362-5 (2006) 
 
Substance-P receptor
Name:Substance-P receptor
Type:G Protein-Coupled Receptor (GPCR)
Mol. Mass.:46254.43
Organism:Homo sapiens (Human)
Description:P25103
Residue:407
BDBM50178573
NameBDBM50178573
Synonyms:CHEMBL381081 | N-(3,5-bis(trifluoromethyl)benzyl)-N-methyl-6-(4-methylpiperazin-1-yl)-3-o-tolylpicolinamide
TypeSmall organic molecule
Emp. Form.C28H28F6N4O
Mol. Mass.550.5385
SMILESCN(Cc1cc(cc(c1)C(F)(F)F)C(F)(F)F)C(=O)c1nc(ccc1-c1ccccc1C)N1CCN(C)CC1