Reaction Details
TargetSubstance-P receptor
LigandBDBM50178583
Substrate/Competitorn/a
Meas. Tech.ChEMBL_337893 (CHEMBL868375)
Ki 3.3±n/a nM
Citation Hoffmann, TBös, MStadler, HSchnider, PHunkeler, WGodel, TGalley, GBallard, TMHiggins, GAPoli, SMSleight, AJ Design and synthesis of a novel, achiral class of highly potent and selective, orally active neurokinin-1 receptor antagonists. Bioorg Med Chem Lett16:1362-5 (2006) 
 
Substance-P receptor
Name:Substance-P receptor
Type:G Protein-Coupled Receptor (GPCR)
Mol. Mass.:46254.43
Organism:Homo sapiens (Human)
Description:P25103
Residue:407
BDBM50178583
NameBDBM50178583
Synonyms:2-(3,5-bis(trifluoromethyl)phenyl)-N,2-dimethyl-N-(3-o-tolylpyridin-4-yl)propanamide | CHEMBL206268
TypeSmall organic molecule
Emp. Form.C25H22F6N2O
Mol. Mass.480.4454
SMILESCN(C(=O)C(C)(C)c1cc(cc(c1)C(F)(F)F)C(F)(F)F)c1ccncc1-c1ccccc1C