Reaction Details
TargetD(3) dopamine receptor
LigandBDBM50178623
Substrate/Competitorn/a
Meas. Tech.ChEMBL_325303 (CHEMBL859710)
Ki 0.52±n/a nM
Citation Leopoldo, MLacivita, EColabufo, NAContino, MBerardi, FPerrone, R First structure-activity relationship study on dopamine D3 receptor agents with N-[4-(4-arylpiperazin-1-yl)butyl]arylcarboxamide structure. J Med Chem48:7919-22 (2005) 
 
D(3) dopamine receptor
Name:D(3) dopamine receptor
Type:n/a
Mol. Mass.:44243.43
Organism:Homo sapiens (Human)
Description:n/a
Residue:400
BDBM50178623
NameBDBM50178623
Synonyms:CHEMBL110365 | N-(4-(4-(2-methoxyphenyl)piperazin-1-yl)butyl)-9H-fluorene-2-carboxamide
TypeSmall organic molecule
Emp. Form.C29H33N3O2
Mol. Mass.455.5912
SMILESCOc1ccccc1N1CCN(CCCCNC(=O)c2ccc-3c(Cc4ccccc-34)c2)CC1