Reaction Details
TargetD(3) dopamine receptor
LigandBDBM50132080
Substrate/Competitorn/a
Meas. Tech.ChEMBL_325303 (CHEMBL859710)
Ki 0.3±n/a nM
Citation Leopoldo, MLacivita, EColabufo, NAContino, MBerardi, FPerrone, R First structure-activity relationship study on dopamine D3 receptor agents with N-[4-(4-arylpiperazin-1-yl)butyl]arylcarboxamide structure. J Med Chem48:7919-22 (2005) 
 
D(3) dopamine receptor
Name:D(3) dopamine receptor
Type:n/a
Mol. Mass.:44243.43
Organism:Homo sapiens (Human)
Description:n/a
Residue:400
BDBM50132080
NameBDBM50132080
Synonyms:Biphenyl-4-carboxylic acid {4-[4-(2-methoxy-phenyl)-piperazin-1-yl]-butyl}-amide; oxalic acid CHEMBL129483
TypeSmall organic molecule
Emp. Form.C28H33N3O2
Mol. Mass.443.5805
SMILESCOc1ccccc1N1CCN(CCCCNC(=O)c2ccc(cc2)-c2ccccc2)CC1