Reaction Details
TargetDelta-type opioid receptor
LigandBDBM50178754
Substrate/Competitorn/a
Meas. Tech.ChEMBL_326435 (CHEMBL867593)
Ki 0.287±n/a nM
Citation Li, TFujita, YShiotani, KMiyazaki, ATsuda, YAmbo, ASasaki, YJinsmaa, YMarczak, EBryant, SDSalvadori, SLazarus, LHOkada, Y Potent Dmt-Tic pharmacophoric delta- and mu-opioid receptor antagonists. J Med Chem48:8035-44 (2005) 
 
Delta-type opioid receptor
Name:Delta-type opioid receptor
Type:G Protein-Coupled Receptor (GPCR)
Mol. Mass.:40465.04
Organism:Rattus norvegicus (rat)
Description:Competition binding assays were using CHO-K1 cell membranes expressing the opioid receptor.
Residue:372
BDBM50178754
NameBDBM50178754
Synonyms:3,6-bis-(N,N-dimethyl-Dmt-Tic-NH-propyl)-2(1H)-pyrazinone | CHEMBL261905
TypeSmall organic molecule
Emp. Form.C57H72N8O7
Mol. Mass.981.231
SMILESCN(C)[C@@H](Cc1c(C)cc(O)cc1C)C(=O)N1Cc2ccccc2CC1C(=O)NCCCc1[nH]c(=O)c(CCCNC(=O)C2Cc3ccccc3CN2C(=O)[C@H](Cc2c(C)cc(O)cc2C)N(C)C)nc1C