Reaction Details
TargetDelta-type opioid receptor
LigandBDBM50178758
Substrate/Competitorn/a
Meas. Tech.ChEMBL_326435 (CHEMBL867593)
Ki 0.323±n/a nM
Citation Li, TFujita, YShiotani, KMiyazaki, ATsuda, YAmbo, ASasaki, YJinsmaa, YMarczak, EBryant, SDSalvadori, SLazarus, LHOkada, Y Potent Dmt-Tic pharmacophoric delta- and mu-opioid receptor antagonists. J Med Chem48:8035-44 (2005) 
 
Delta-type opioid receptor
Name:Delta-type opioid receptor
Type:G Protein-Coupled Receptor (GPCR)
Mol. Mass.:40465.04
Organism:Rattus norvegicus (rat)
Description:Competition binding assays were using CHO-K1 cell membranes expressing the opioid receptor.
Residue:372
BDBM50178758
NameBDBM50178758
Synonyms:3,6-bis(Dmt-Tic-NH-butyl)-2(1H)-pyrazinone | CHEMBL373668
TypeSmall organic molecule
Emp. Form.C55H68N8O7
Mol. Mass.953.1778
SMILESCc1cc(O)cc(C)c1C[C@H](N)C(=O)N1Cc2ccccc2CC1C(=O)NCCCCc1[nH]c(=O)c(CCCCNC(=O)C2Cc3ccccc3CN2C(=O)[C@@H](N)Cc2c(C)cc(O)cc2C)nc1C