Reaction Details
TargetDelta-type opioid receptor
LigandBDBM50178755
Substrate/Competitorn/a
Meas. Tech.ChEMBL_326435 (CHEMBL867593)
Ki 0.163±n/a nM
Citation Li, TFujita, YShiotani, KMiyazaki, ATsuda, YAmbo, ASasaki, YJinsmaa, YMarczak, EBryant, SDSalvadori, SLazarus, LHOkada, Y Potent Dmt-Tic pharmacophoric delta- and mu-opioid receptor antagonists. J Med Chem48:8035-44 (2005) 
 
Delta-type opioid receptor
Name:Delta-type opioid receptor
Type:G Protein-Coupled Receptor (GPCR)
Mol. Mass.:40465.04
Organism:Rattus norvegicus (rat)
Description:Competition binding assays were using CHO-K1 cell membranes expressing the opioid receptor.
Residue:372
BDBM50178755
NameBDBM50178755
Synonyms:3,6-bis(Dmt-Tic-NH-methyl)-2(1H)-pyrazinone | CHEMBL200890
TypeSmall organic molecule
Emp. Form.C49H56N8O7
Mol. Mass.869.0183
SMILESCc1cc(O)cc(C)c1C[C@H](N)C(=O)N1Cc2ccccc2CC1C(=O)NCc1[nH]c(=O)c(CNC(=O)C2Cc3ccccc3CN2C(=O)[C@@H](N)Cc2c(C)cc(O)cc2C)nc1C