Reaction Details
TargetNAD-dependent protein deacetylase sirtuin-1
LigandBDBM50178775
Substrate/Competitorn/a
Meas. Tech.ChEMBL_325278 (CHEMBL859689)
IC50 63±n/a nM
Citation Napper, ADHixon, JMcDonagh, TKeavey, KPons, JFBarker, JYau, WTAmouzegh, PFlegg, AHamelin, EThomas, RJKates, MJones, SNavia, MASaunders, JODiStefano, PSCurtis, R Discovery of indoles as potent and selective inhibitors of the deacetylase SIRT1. J Med Chem48:8045-54 (2005) 
 
NAD-dependent protein deacetylase sirtuin-1
Name:NAD-dependent protein deacetylase sirtuin-1
Type:Developmental protein; hydrolase
Mol. Mass.:81626.66
Organism:Homo sapiens (Human)
Description:n/a
Residue:747
BDBM50178775
NameBDBM50178775
Synonyms:(S)-2-chloro-5,6,7,8,9,10-hexahydrocyclohepta[b]indole-6-carboxamide CHEMBL198609
TypeSmall organic molecule
Emp. Form.C14H15ClN2O
Mol. Mass.262.735
SMILESNC(=O)[C@H]1CCCCc2c1[nH]c1ccc(Cl)cc21